Reaction Details
TargetNADPH oxidase 4
LigandBDBM50330695
Substrate/Competitorn/a
Meas. Tech.ChEMBL_685143 (CHEMBL1286959)
Ki>30000±n/a nM
Citation Laleu, BGaggini, FOrchard, MFioraso-Cartier, LCagnon, LHoungninou-Molango, SGradia, ADuboux, GMerlot, CHeitz, FSzyndralewiez, CPage, P First in class, potent, and orally bioavailable NADPH oxidase isoform 4 (Nox4) inhibitors for the treatment of idiopathic pulmonary fibrosis. J Med Chem53:7715-30 (2010) 
 
NADPH oxidase 4
Name:NADPH oxidase 4
Type:PROTEIN
Mol. Mass.:66954.54
Organism:Homo sapiens (Human)
Description:ChEMBL_792879
Residue:578
BDBM50330695
NameBDBM50330695
Synonyms:2-(benzo[d]thiazol-2-yl)-1-benzyl-4-methyl-5-((tetrahydrofuran-2-yl)methyl)-1H-pyrazolo[4,3-c]pyridine-3,6(2H,5H)-dione | CHEMBL1277487
TypeSmall organic molecule
Emp. Form.C26H24N4O3S
Mol. Mass.472.559
SMILESCc1n(CC2CCCO2)c(=O)cc2n(Cc3ccccc3)n(-c3nc4ccccc4s3)c(=O)c12