Reaction Details
TargetNADPH oxidase 4
LigandBDBM50330699
Substrate/Competitorn/a
Meas. Tech.ChEMBL_685143 (CHEMBL1286959)
Ki>30000±n/a nM
Citation Laleu, BGaggini, FOrchard, MFioraso-Cartier, LCagnon, LHoungninou-Molango, SGradia, ADuboux, GMerlot, CHeitz, FSzyndralewiez, CPage, P First in class, potent, and orally bioavailable NADPH oxidase isoform 4 (Nox4) inhibitors for the treatment of idiopathic pulmonary fibrosis. J Med Chem53:7715-30 (2010) 
 
NADPH oxidase 4
Name:NADPH oxidase 4
Type:PROTEIN
Mol. Mass.:66954.54
Organism:Homo sapiens (Human)
Description:ChEMBL_792879
Residue:578
BDBM50330699
NameBDBM50330699
Synonyms:5-(2-(1H-indol-3-yl)ethyl)-1-(4-fluorobenzyl)-4-methyl-2-phenyl-1H-pyrazolo[4,3-c]pyridine-3,6(2H,5H)-dione | CHEMBL1277674
TypeSmall organic molecule
Emp. Form.C30H25FN4O2
Mol. Mass.492.5435
SMILESCc1n(CCc2c[nH]c3ccccc23)c(=O)cc2n(Cc3ccc(F)cc3)n(-c3ccccc3)c(=O)c12