Reaction Details
TargetNADPH oxidase 4
LigandBDBM50330700
Substrate/Competitorn/a
Meas. Tech.ChEMBL_685143 (CHEMBL1286959)
Ki>30000±n/a nM
Citation Laleu, BGaggini, FOrchard, MFioraso-Cartier, LCagnon, LHoungninou-Molango, SGradia, ADuboux, GMerlot, CHeitz, FSzyndralewiez, CPage, P First in class, potent, and orally bioavailable NADPH oxidase isoform 4 (Nox4) inhibitors for the treatment of idiopathic pulmonary fibrosis. J Med Chem53:7715-30 (2010) 
 
NADPH oxidase 4
Name:NADPH oxidase 4
Type:PROTEIN
Mol. Mass.:66954.54
Organism:Homo sapiens (Human)
Description:ChEMBL_792879
Residue:578
BDBM50330700
NameBDBM50330700
Synonyms:1-(2-chlorobenzyl)-4-methyl-5-(3-(2-oxopyrrolidin-1-yl)propyl)-2-phenyl-1H-pyrazolo[4,3-c]pyridine-3,6(2H,5H)-dione | CHEMBL1277675
TypeSmall organic molecule
Emp. Form.C27H27ClN4O3
Mol. Mass.490.981
SMILESCc1n(CCCN2CCCC2=O)c(=O)cc2n(Cc3ccccc3Cl)n(-c3ccccc3)c(=O)c12