Reaction Details
TargetNADPH oxidase 4
LigandBDBM50330711
Substrate/Competitorn/a
Meas. Tech.ChEMBL_685143 (CHEMBL1286959)
Ki 293±n/a nM
Citation Laleu, BGaggini, FOrchard, MFioraso-Cartier, LCagnon, LHoungninou-Molango, SGradia, ADuboux, GMerlot, CHeitz, FSzyndralewiez, CPage, P First in class, potent, and orally bioavailable NADPH oxidase isoform 4 (Nox4) inhibitors for the treatment of idiopathic pulmonary fibrosis. J Med Chem53:7715-30 (2010) 
 
NADPH oxidase 4
Name:NADPH oxidase 4
Type:PROTEIN
Mol. Mass.:66954.54
Organism:Homo sapiens (Human)
Description:ChEMBL_792879
Residue:578
BDBM50330711
NameBDBM50330711
Synonyms:3-(4,5-dimethyl-3,6-dioxo-5,6-dihydro-1H-pyrazolo[4,3-c]pyridin-2(3H)-yl)benzonitrile | CHEMBL1278017
TypeSmall organic molecule
Emp. Form.C15H12N4O2
Mol. Mass.280.2814
SMILESCc1n(C)c(=O)cc2[nH]n(-c3cccc(c3)C#N)c(=O)c12