Reaction Details
TargetNADPH oxidase 4
LigandBDBM50330721
Substrate/Competitorn/a
Meas. Tech.ChEMBL_685143 (CHEMBL1286959)
Ki 259±n/a nM
Citation Laleu, BGaggini, FOrchard, MFioraso-Cartier, LCagnon, LHoungninou-Molango, SGradia, ADuboux, GMerlot, CHeitz, FSzyndralewiez, CPage, P First in class, potent, and orally bioavailable NADPH oxidase isoform 4 (Nox4) inhibitors for the treatment of idiopathic pulmonary fibrosis. J Med Chem53:7715-30 (2010) 
 
NADPH oxidase 4
Name:NADPH oxidase 4
Type:PROTEIN
Mol. Mass.:66954.54
Organism:Homo sapiens (Human)
Description:ChEMBL_792879
Residue:578
BDBM50330721
NameBDBM50330721
Synonyms:4-((2-(2-chlorophenyl)-4-methyl-3,6-dioxo-2,3-dihydro-1H-pyrazolo[4,3-c]pyridin-5(6H)-yl)methyl)benzenesulfonamide | CHEMBL1276945
TypeSmall organic molecule
Emp. Form.C20H17ClN4O4S
Mol. Mass.444.891
SMILESCc1n(Cc2ccc(cc2)S(N)(=O)=O)c(=O)cc2[nH]n(-c3ccccc3Cl)c(=O)c12