Reaction Details
TargetNADPH oxidase 4
LigandBDBM50330737
Substrate/Competitorn/a
Meas. Tech.ChEMBL_685143 (CHEMBL1286959)
Ki 153±n/a nM
Citation Laleu, BGaggini, FOrchard, MFioraso-Cartier, LCagnon, LHoungninou-Molango, SGradia, ADuboux, GMerlot, CHeitz, FSzyndralewiez, CPage, P First in class, potent, and orally bioavailable NADPH oxidase isoform 4 (Nox4) inhibitors for the treatment of idiopathic pulmonary fibrosis. J Med Chem53:7715-30 (2010) 
 
NADPH oxidase 4
Name:NADPH oxidase 4
Type:PROTEIN
Mol. Mass.:66954.54
Organism:Homo sapiens (Human)
Description:ChEMBL_792879
Residue:578
BDBM50330737
NameBDBM50330737
Synonyms:4-((4-fluorophenoxy)methyl)-5-(2-methoxyethyl)-2-(2-morpholinoethyl)-1H-pyrazolo[4,3-c]pyridine-3,6(2H,5H)-dione | CHEMBL1277583
TypeSmall organic molecule
Emp. Form.C22H27FN4O5
Mol. Mass.446.472
SMILESCOCCn1c(COc2ccc(F)cc2)c2c(cc1=O)[nH]n(CCN1CCOCC1)c2=O