Reaction Details
TargetNADPH oxidase 4
LigandBDBM50330738
Substrate/Competitorn/a
Meas. Tech.ChEMBL_685143 (CHEMBL1286959)
Ki 114±n/a nM
Citation Laleu, BGaggini, FOrchard, MFioraso-Cartier, LCagnon, LHoungninou-Molango, SGradia, ADuboux, GMerlot, CHeitz, FSzyndralewiez, CPage, P First in class, potent, and orally bioavailable NADPH oxidase isoform 4 (Nox4) inhibitors for the treatment of idiopathic pulmonary fibrosis. J Med Chem53:7715-30 (2010) 
 
NADPH oxidase 4
Name:NADPH oxidase 4
Type:PROTEIN
Mol. Mass.:66954.54
Organism:Homo sapiens (Human)
Description:ChEMBL_792879
Residue:578
BDBM50330738
NameBDBM50330738
Synonyms:2-(2-chloro-4-fluorophenyl)-5-(2-(pyridin-2-yl)ethyl)-4-(pyrrolidin-1-ylmethyl)-1H-pyrazolo[4,3-c]pyridine-3,6(2H,5H)-dione | CHEMBL1277676
TypeSmall organic molecule
Emp. Form.C24H23ClFN5O2
Mol. Mass.467.923
SMILESFc1ccc(c(Cl)c1)-n1[nH]c2cc(=O)n(CCc3ccccn3)c(CN3CCCC3)c2c1=O