Reaction Details
TargetAdenosine receptor A3
LigandBDBM50003879
Substrate/Competitorn/a
Meas. Tech.ChEMBL_685335 (CHEMBL1287450)
Ki 0.331131±n/a nM
Citation Dal Ben, DBuccioni, MLambertucci, CMarucci, GThomas, AVolpini, RCristalli, G Molecular modeling study on potent and selective adenosine A(3) receptor agonists. Bioorg Med Chem18:7923-30 (2010) 
 
Adenosine receptor A3
Name:Adenosine receptor A3
Type:G Protein-Coupled Receptor (GPCR)
Mol. Mass.:36197.32
Organism:Homo sapiens (Human)
Description:P0DMS8
Residue:318
BDBM50003879
NameBDBM50003879
Synonyms:CHEMBL1277130
TypeSmall organic molecule
Emp. Form.C22H22N6O5
Mol. Mass.450.4473
SMILESCNC(=O)[C@H]1O[C@H]([C@H](O)[C@@H]1O)n1cnc2c(NC)nc(nc12)C#Cc1ccc(cc1)C(C)=O