Reaction Details
TargetTransporter
LigandBDBM50330790
Substrate/Competitorn/a
Meas. Tech.ChEMBL_685424 (CHEMBL1285323)
Ki 4.3±n/a nM
Citation Altenbach, RJBlack, LAStrakhova, MIManelli, AMCarr, TLMarsh, KCWetter, JMWensink, EJHsieh, GCHonore, PGarrison, TRBrioni, JDCowart, MD Diaryldiamines with dual inhibition of the histamine H(3) receptor and the norepinephrine transporter and the efficacy of 4-(3-(methylamino)-1-phenylpropyl)-6-(2-(pyrrolidin-1-yl)ethoxy)naphthalen-1-ol in pain. J Med Chem53:7869-73 (2010) 
 
Transporter
Name:Transporter
Type:Multi-pass membrane protein
Mol. Mass.:69236.90
Organism:Rattus norvegicus (rat)
Description:Q63380
Residue:617
BDBM50330790
NameBDBM50330790
Synonyms:CHEMBL1277594 | N-Methyl-3-phenyl-3-(4-(2-(pyrrolidin-1-yl)ethoxy)phenyl)-propan-1-amine
TypeSmall organic molecule
Emp. Form.C22H30N2O
Mol. Mass.338.4864
SMILESCNCCC(c1ccccc1)c1ccc(OCCN2CCCC2)cc1