Reaction Details
TargetSodium-dependent serotonin transporter
LigandBDBM50330788
Substrate/Competitorn/a
Meas. Tech.ChEMBL_685452 (CHEMBL1285351)
Ki>70±n/a nM
Citation Altenbach, RJBlack, LAStrakhova, MIManelli, AMCarr, TLMarsh, KCWetter, JMWensink, EJHsieh, GCHonore, PGarrison, TRBrioni, JDCowart, MD Diaryldiamines with dual inhibition of the histamine H(3) receptor and the norepinephrine transporter and the efficacy of 4-(3-(methylamino)-1-phenylpropyl)-6-(2-(pyrrolidin-1-yl)ethoxy)naphthalen-1-ol in pain. J Med Chem53:7869-73 (2010) 
 
Sodium-dependent serotonin transporter
Name:Sodium-dependent serotonin transporter
Type:Multi-pass membrane protein
Mol. Mass.:70322.51
Organism:Homo sapiens (Human)
Description:P31645
Residue:630
BDBM50330788
NameBDBM50330788
Synonyms:CHEMBL1277500 | N1-Methyl-N2-phenyl-N2-(4-(2-(pyrrolidin-1-yl)ethoxy)phenyl)-ethane-1,2-diamine
TypeSmall organic molecule
Emp. Form.C21H29N3O
Mol. Mass.339.4745
SMILESCNCCN(c1ccccc1)c1ccc(OCCN2CCCC2)cc1