Reaction Details
TargetCruzipain
LigandBDBM50114653
Substrate/Competitorn/a
Meas. Tech.ChEMBL_683902 (CHEMBL1285900)
IC50 100±n/a nM
Citation Hernandes, MZRabello, MMLeite, ACCardoso, MVMoreira, DRBrondani, DJSimone, CAReis, LCSouza, MAPereira, VRFerreira, RSMcKerrow, JH Studies toward the structural optimization of novel thiazolylhydrazone-based potent antitrypanosomal agents. Bioorg Med Chem18:7826-35 (2010) 
 
Cruzipain
Name:Cruzipain
Type:Protein
Mol. Mass.:49831.41
Organism:Trypanosoma cruzi
Description:P25779
Residue:467
BDBM50114653
NameBDBM50114653
Synonyms:(1E)-1-(3,4-dichlorophenyl)ethan-1-one thiosemicarbazone | CHEMBL90512
TypeSmall organic molecule
Emp. Form.C9H9Cl2N3S
Mol. Mass.262.159
SMILESCC(=NNC(N)=S)c1ccc(Cl)c(Cl)c1