Reaction Details
TargetNeuromedin-K receptor
LigandBDBM50412947
Substrate/Competitorn/a
Meas. Tech.ChEMBL_684807 (CHEMBL1285944)
Ki 5.01±n/a nM
Citation Geldenhuys, WJKuzenko, SRSimmons, MA Virtual screening to identify novel antagonists for the G protein-coupled NK3 receptor. J Med Chem53:8080-8 (2010) 
 
Neuromedin-K receptor
Name:Neuromedin-K receptor
Type:Enzyme
Mol. Mass.:52221.96
Organism:Homo sapiens (Human)
Description:P29371
Residue:465
BDBM50412947
NameBDBM50412947
Synonyms:5-(3-METHYL-1-TRIAZENO)IMIDAZOLE-4-CARBOXAMIDE
TypeSmall organic molecule
Emp. Form.C26H23N3O
Mol. Mass.393.4803
SMILESNc1c(nc2ccccc2c1C(=O)N[C@@H](C1CC1)c1ccccc1)-c1ccccc1