Reaction Details
TargetSigma non-opioid intracellular receptor 1
LigandBDBM50331295
Substrate/Competitorn/a
Meas. Tech.ChEMBL_686645 (CHEMBL1292498)
Ki 193±n/a nM
Citation Tewes, BFrehland, BSchepmann, DSchmidtke, KUWinckler, TWünsch, B Conformationally constrained NR2B selective NMDA receptor antagonists derived from ifenprodil: Synthesis and biological evaluation of tetrahydro-3-benzazepine-1,7-diols. Bioorg Med Chem18:8005-15 (2010) 
 
Sigma non-opioid intracellular receptor 1
Name:Sigma non-opioid intracellular receptor 1
Type:Protein
Mol. Mass.:25307.17
Organism:Cavia porcellus (Guinea pig)
Description:Q60492
Residue:223
BDBM50331295
NameBDBM50331295
Synonyms:(+/-)-7-(benzyloxy)-3-(3-phenoxypropyl)-2,3,4,5-tetrahydro-1H-benzo[d]azepin-1-ol | CHEMBL1290052
TypeSmall organic molecule
Emp. Form.C26H29NO3
Mol. Mass.403.5134
SMILESOC1CN(CCCOc2ccccc2)CCc2cc(OCc3ccccc3)ccc12