Reaction Details
TargetSigma non-opioid intracellular receptor 1
LigandBDBM50331298
Substrate/Competitorn/a
Meas. Tech.ChEMBL_686645 (CHEMBL1292498)
Ki>1000±n/a nM
Citation Tewes, BFrehland, BSchepmann, DSchmidtke, KUWinckler, TWünsch, B Conformationally constrained NR2B selective NMDA receptor antagonists derived from ifenprodil: Synthesis and biological evaluation of tetrahydro-3-benzazepine-1,7-diols. Bioorg Med Chem18:8005-15 (2010) 
 
Sigma non-opioid intracellular receptor 1
Name:Sigma non-opioid intracellular receptor 1
Type:Protein
Mol. Mass.:25307.17
Organism:Cavia porcellus (Guinea pig)
Description:Q60492
Residue:223
BDBM50331298
NameBDBM50331298
Synonyms:(+/-)-7-(Benzyloxy)-3-{3-[2-(4-tert-butylphenyl)-5,5-dimethyl-1,3-dioxan-2-yl]propyl}-2,3,4,5-tetrahydro-1H-3-benzazepin-1-ol | CHEMBL1290270
TypeSmall organic molecule
Emp. Form.C36H47NO4
Mol. Mass.557.7627
SMILESCC(C)(C)c1ccc(cc1)C1(CCCN2CCc3cc(OCc4ccccc4)ccc3C(O)C2)OCC(C)(C)CO1