Reaction Details
TargetSigma non-opioid intracellular receptor 1
LigandBDBM50331306
Substrate/Competitorn/a
Meas. Tech.ChEMBL_686645 (CHEMBL1292498)
Ki 10±n/a nM
Citation Tewes, BFrehland, BSchepmann, DSchmidtke, KUWinckler, TWünsch, B Conformationally constrained NR2B selective NMDA receptor antagonists derived from ifenprodil: Synthesis and biological evaluation of tetrahydro-3-benzazepine-1,7-diols. Bioorg Med Chem18:8005-15 (2010) 
 
Sigma non-opioid intracellular receptor 1
Name:Sigma non-opioid intracellular receptor 1
Type:Protein
Mol. Mass.:25307.17
Organism:Cavia porcellus (Guinea pig)
Description:Q60492
Residue:223
BDBM50331306
NameBDBM50331306
Synonyms:CHEMBL1289057 | cis-7-(Benzyloxy)-3-(4-phenylcyclohexyl)-2,3,4,5-tetrahydro-1H-3-benzazepin-1-ol
TypeSmall organic molecule
Emp. Form.C29H33NO2
Mol. Mass.427.5778
SMILESOC1CN(CCc2cc(OCc3ccccc3)ccc12)[C@H]1CC[C@H](CC1)c1ccccc1