Reaction Details
TargetSigma non-opioid intracellular receptor 1
LigandBDBM50331308
Substrate/Competitorn/a
Meas. Tech.ChEMBL_686645 (CHEMBL1292498)
Ki 604±n/a nM
Citation Tewes, BFrehland, BSchepmann, DSchmidtke, KUWinckler, TWünsch, B Conformationally constrained NR2B selective NMDA receptor antagonists derived from ifenprodil: Synthesis and biological evaluation of tetrahydro-3-benzazepine-1,7-diols. Bioorg Med Chem18:8005-15 (2010) 
 
Sigma non-opioid intracellular receptor 1
Name:Sigma non-opioid intracellular receptor 1
Type:Protein
Mol. Mass.:25307.17
Organism:Cavia porcellus (Guinea pig)
Description:Q60492
Residue:223
BDBM50331308
NameBDBM50331308
Synonyms:(+/-)-7-(Benzyloxy)-3-[4-(piperidin-1-yl)benzyl]-2,3,4,5-tetrahydro-1H-3-benzazepin-1-ol | CHEMBL1289173
TypeSmall organic molecule
Emp. Form.C29H34N2O2
Mol. Mass.442.5925
SMILESOC1CN(Cc2ccc(cc2)N2CCCCC2)CCc2cc(OCc3ccccc3)ccc12