Reaction Details
TargetSigma non-opioid intracellular receptor 1
LigandBDBM50331311
Substrate/Competitorn/a
Meas. Tech.ChEMBL_686645 (CHEMBL1292498)
Ki 293±n/a nM
Citation Tewes, BFrehland, BSchepmann, DSchmidtke, KUWinckler, TWünsch, B Conformationally constrained NR2B selective NMDA receptor antagonists derived from ifenprodil: Synthesis and biological evaluation of tetrahydro-3-benzazepine-1,7-diols. Bioorg Med Chem18:8005-15 (2010) 
 
Sigma non-opioid intracellular receptor 1
Name:Sigma non-opioid intracellular receptor 1
Type:Protein
Mol. Mass.:25307.17
Organism:Cavia porcellus (Guinea pig)
Description:Q60492
Residue:223
BDBM50331311
NameBDBM50331311
Synonyms:(+/-)-4-(7-Benzyloxy-1-hydroxy-2,3,4,5-tetrahydro-1H-3-benzazepin-3-yl)-1-(4-fluorophenyl)butan-1-one | CHEMBL1289288
TypeSmall organic molecule
Emp. Form.C27H28FNO3
Mol. Mass.433.5145
SMILESOC1CN(CCCC(=O)c2ccc(F)cc2)CCc2cc(OCc3ccccc3)ccc12