Reaction Details
TargetSigma non-opioid intracellular receptor 1
LigandBDBM50331318
Substrate/Competitorn/a
Meas. Tech.ChEMBL_686645 (CHEMBL1292498)
Ki 200±n/a nM
Citation Tewes, BFrehland, BSchepmann, DSchmidtke, KUWinckler, TWünsch, B Conformationally constrained NR2B selective NMDA receptor antagonists derived from ifenprodil: Synthesis and biological evaluation of tetrahydro-3-benzazepine-1,7-diols. Bioorg Med Chem18:8005-15 (2010) 
 
Sigma non-opioid intracellular receptor 1
Name:Sigma non-opioid intracellular receptor 1
Type:Protein
Mol. Mass.:25307.17
Organism:Cavia porcellus (Guinea pig)
Description:Q60492
Residue:223
BDBM50331318
NameBDBM50331318
Synonyms:(+/-)-trans-3-(4-Phenylcyclohexyl)-2,3,4,5-tetrahydro-1H-3-benzazepine-1,7-diol | CHEMBL1289954
TypeSmall organic molecule
Emp. Form.C22H27NO2
Mol. Mass.337.4553
SMILESOC1CN(CCc2cc(O)ccc12)[C@H]1CC[C@@H](CC1)c1ccccc1