Reaction Details
TargetGlutamate receptor ionotropic, NMDA 1/2B
LigandBDBM50331305
Substrate/Competitorn/a
Meas. Tech.ChEMBL_686641 (CHEMBL1292494)
Ki>1000±n/a nM
Citation Tewes, BFrehland, BSchepmann, DSchmidtke, KUWinckler, TWünsch, B Conformationally constrained NR2B selective NMDA receptor antagonists derived from ifenprodil: Synthesis and biological evaluation of tetrahydro-3-benzazepine-1,7-diols. Bioorg Med Chem18:8005-15 (2010) 
 
Glutamate receptor ionotropic, NMDA 1/2B
Name:Glutamate receptor ionotropic, NMDA 1/2B
Type:Enzyme
Mol. Mass.:n/a
Description:n/a
Components:This complex has 2 components.
Component 1
Name:Glutamate receptor ionotropic, NMDA 1
Synonyms:GRIN1 Glutamate [NMDA] receptor subunit zeta-1 N-methyl-D-aspartate receptor subunit NR1 NMDZ1_HUMAN | phencyclidine
Type:Enzyme Catalytic Domain
Mol. Mass.:105397.81
Organism:Homo sapiens (Human)
Description:Q05586
Residue:938
Component 2
Name:Glutamate receptor ionotropic, NMDA 2B
Synonyms:GRIN2B Glutamate [NMDA] receptor subunit epsilon 2 N-methyl D-aspartate receptor subtype 2B NMDAR2B NR3 | hNR3
Type:PROTEIN
Mol. Mass.:166375.46
Organism:Homo sapiens (Human)
Description:ChEMBL_1438829
Residue:1484
BDBM50331305
NameBDBM50331305
Synonyms:(+/-)-3-(1-Benzoylpiperidin-4-yl)-7-benzyloxy-2,3,4,5-tetrahydro-1H-3-benzazepin-1-ol | CHEMBL1290726
TypeSmall organic molecule
Emp. Form.C29H32N2O3
Mol. Mass.456.576
SMILESOC1CN(CCc2cc(OCc3ccccc3)ccc12)C1CCN(CC1)C(=O)c1ccccc1