Reaction Details
TargetGlutamate receptor 2
LigandBDBM50331372
Substrate/Competitorn/a
Meas. Tech.ChEMBL_687157 (CHEMBL1291782)
EC50 20000±n/a nM
Citation Thewlis, KMAldegheri, LHarries, MHMookherjee, COliosi, BWard, SE N-substituted pyrrolidines and tetrahydrofurans as novel AMPAR positive modulators. Bioorg Med Chem Lett20:7116-9 (2010) 
 
Glutamate receptor 2
Name:Glutamate receptor 2
Type:Enzyme Catalytic Domain
Mol. Mass.:98825.96
Organism:Homo sapiens (Human)
Description:Glutamate AMPA 2 GRIA2 HUMAN::P42262
Residue:883
BDBM50331372
NameBDBM50331372
Synonyms:CHEMBL1290276 | N-((3R,4R)-4-(4'-cyanobiphenyl-4-yl)-1-isopropylpyrrolidin-3-yl)propane-2-sulfonamide
TypeSmall organic molecule
Emp. Form.C23H29N3O2S
Mol. Mass.411.56
SMILESCC(C)N1C[C@H](NS(=O)(=O)C(C)C)[C@H](C1)c1ccc(cc1)-c1ccc(cc1)C#N