Reaction Details
TargetGlutamate receptor 2
LigandBDBM50331373
Substrate/Competitorn/a
Meas. Tech.ChEMBL_687157 (CHEMBL1291782)
EC50 6200±n/a nM
Citation Thewlis, KMAldegheri, LHarries, MHMookherjee, COliosi, BWard, SE N-substituted pyrrolidines and tetrahydrofurans as novel AMPAR positive modulators. Bioorg Med Chem Lett20:7116-9 (2010) 
 
Glutamate receptor 2
Name:Glutamate receptor 2
Type:Enzyme Catalytic Domain
Mol. Mass.:98825.96
Organism:Homo sapiens (Human)
Description:Glutamate AMPA 2 GRIA2 HUMAN::P42262
Residue:883
BDBM50331373
NameBDBM50331373
Synonyms:CHEMBL1290391 | N-((3R,4R)-4-(4'-cyanobiphenyl-4-yl)-1-phenylpyrrolidin-3-yl)propane-2-sulfonamide
TypeSmall organic molecule
Emp. Form.C26H27N3O2S
Mol. Mass.445.576
SMILESCC(C)S(=O)(=O)N[C@H]1CN(C[C@@H]1c1ccc(cc1)-c1ccc(cc1)C#N)c1ccccc1