Reaction Details
TargetGlutamate receptor 2
LigandBDBM50331375
Substrate/Competitorn/a
Meas. Tech.ChEMBL_687157 (CHEMBL1291782)
EC50 4000±n/a nM
Citation Thewlis, KMAldegheri, LHarries, MHMookherjee, COliosi, BWard, SE N-substituted pyrrolidines and tetrahydrofurans as novel AMPAR positive modulators. Bioorg Med Chem Lett20:7116-9 (2010) 
 
Glutamate receptor 2
Name:Glutamate receptor 2
Type:Enzyme Catalytic Domain
Mol. Mass.:98825.96
Organism:Homo sapiens (Human)
Description:Glutamate AMPA 2 GRIA2 HUMAN::P42262
Residue:883
BDBM50331375
NameBDBM50331375
Synonyms:CHEMBL1290503 | N-(4'-((3R,4R)-1-methyl-4-(1-methylethylsulfonamido)pyrrolidin-3-yl)biphenyl-3-yl)acetamide
TypeSmall organic molecule
Emp. Form.C22H29N3O3S
Mol. Mass.415.549
SMILESCC(C)S(=O)(=O)N[C@H]1CN(C)C[C@@H]1c1ccc(cc1)-c1cccc(NC(C)=O)c1