Reaction Details
TargetGlutamate receptor 2
LigandBDBM50331376
Substrate/Competitorn/a
Meas. Tech.ChEMBL_687157 (CHEMBL1291782)
EC50 6300±n/a nM
Citation Thewlis, KMAldegheri, LHarries, MHMookherjee, COliosi, BWard, SE N-substituted pyrrolidines and tetrahydrofurans as novel AMPAR positive modulators. Bioorg Med Chem Lett20:7116-9 (2010) 
 
Glutamate receptor 2
Name:Glutamate receptor 2
Type:Enzyme Catalytic Domain
Mol. Mass.:98825.96
Organism:Homo sapiens (Human)
Description:Glutamate AMPA 2 GRIA2 HUMAN::P42262
Residue:883
BDBM50331376
NameBDBM50331376
Synonyms:CHEMBL1290504 | N-((3R,4R)-4-(3'-acetylbiphenyl-4-yl)-1-methylpyrrolidin-3-yl)propane-2-sulfonamide
TypeSmall organic molecule
Emp. Form.C22H28N2O3S
Mol. Mass.400.534
SMILESCC(C)S(=O)(=O)N[C@H]1CN(C)C[C@@H]1c1ccc(cc1)-c1cccc(c1)C(C)=O