Reaction Details
TargetGlutamate receptor 2
LigandBDBM50331382
Substrate/Competitorn/a
Meas. Tech.ChEMBL_687157 (CHEMBL1291782)
EC50 4000±n/a nM
Citation Thewlis, KMAldegheri, LHarries, MHMookherjee, COliosi, BWard, SE N-substituted pyrrolidines and tetrahydrofurans as novel AMPAR positive modulators. Bioorg Med Chem Lett20:7116-9 (2010) 
 
Glutamate receptor 2
Name:Glutamate receptor 2
Type:Enzyme Catalytic Domain
Mol. Mass.:98825.96
Organism:Homo sapiens (Human)
Description:Glutamate AMPA 2 GRIA2 HUMAN::P42262
Residue:883
BDBM50331382
NameBDBM50331382
Synonyms:CHEMBL1289063 | N-((3R,4R)-4-(4-(6-fluoropyridin-3-yl)phenyl)-1-phenylpyrrolidin-3-yl)propane-2-sulfonamide
TypeSmall organic molecule
Emp. Form.C24H26FN3O2S
Mol. Mass.439.546
SMILESCC(C)S(=O)(=O)N[C@H]1CN(C[C@@H]1c1ccc(cc1)-c1ccc(F)nc1)c1ccccc1