Reaction Details
TargetGlutamate receptor 2
LigandBDBM50331383
Substrate/Competitorn/a
Meas. Tech.ChEMBL_687157 (CHEMBL1291782)
EC50 20000±n/a nM
Citation Thewlis, KMAldegheri, LHarries, MHMookherjee, COliosi, BWard, SE N-substituted pyrrolidines and tetrahydrofurans as novel AMPAR positive modulators. Bioorg Med Chem Lett20:7116-9 (2010) 
 
Glutamate receptor 2
Name:Glutamate receptor 2
Type:Enzyme Catalytic Domain
Mol. Mass.:98825.96
Organism:Homo sapiens (Human)
Description:Glutamate AMPA 2 GRIA2 HUMAN::P42262
Residue:883
BDBM50331383
NameBDBM50331383
Synonyms:CHEMBL1289179 | N-((3R,4R)-1-methyl-4-(4-(thiophen-2-yl)phenyl)pyrrolidin-3-yl)propane-2-sulfonamide
TypeSmall organic molecule
Emp. Form.C18H24N2O2S2
Mol. Mass.364.525
SMILESCC(C)S(=O)(=O)N[C@H]1CN(C)C[C@@H]1c1ccc(cc1)-c1cccs1