Reaction Details
TargetGlutamate receptor 2
LigandBDBM50331385
Substrate/Competitorn/a
Meas. Tech.ChEMBL_687157 (CHEMBL1291782)
EC50 500±n/a nM
Citation Thewlis, KMAldegheri, LHarries, MHMookherjee, COliosi, BWard, SE N-substituted pyrrolidines and tetrahydrofurans as novel AMPAR positive modulators. Bioorg Med Chem Lett20:7116-9 (2010) 
 
Glutamate receptor 2
Name:Glutamate receptor 2
Type:Enzyme Catalytic Domain
Mol. Mass.:98825.96
Organism:Homo sapiens (Human)
Description:Glutamate AMPA 2 GRIA2 HUMAN::P42262
Residue:883
BDBM50331385
NameBDBM50331385
Synonyms:CHEMBL1289181 | N-((3S,4S)-4-(4'-cyanobiphenyl-4-yl)tetrahydrofuran-3-yl)propane-2-sulfonamide
TypeSmall organic molecule
Emp. Form.C20H22N2O3S
Mol. Mass.370.465
SMILESCC(C)S(=O)(=O)N[C@@H]1COC[C@@H]1c1ccc(cc1)-c1ccc(cc1)C#N