Reaction Details
TargetGlutamate receptor 2
LigandBDBM50331391
Substrate/Competitorn/a
Meas. Tech.ChEMBL_687157 (CHEMBL1291782)
EC50 400±n/a nM
Citation Thewlis, KMAldegheri, LHarries, MHMookherjee, COliosi, BWard, SE N-substituted pyrrolidines and tetrahydrofurans as novel AMPAR positive modulators. Bioorg Med Chem Lett20:7116-9 (2010) 
 
Glutamate receptor 2
Name:Glutamate receptor 2
Type:Enzyme Catalytic Domain
Mol. Mass.:98825.96
Organism:Homo sapiens (Human)
Description:Glutamate AMPA 2 GRIA2 HUMAN::P42262
Residue:883
BDBM50331391
NameBDBM50331391
Synonyms:CHEMBL1289523 | N-((3S,4S)-4-(4-(thiophen-3-yl)phenyl)tetrahydrofuran-3-yl)propane-2-sulfonamide
TypeSmall organic molecule
Emp. Form.C17H21NO3S2
Mol. Mass.351.484
SMILESCC(C)S(=O)(=O)N[C@@H]1COC[C@@H]1c1ccc(cc1)-c1ccsc1