Reaction Details
TargetPotassium voltage-gated channel subfamily H member 2
LigandBDBM50331368
Substrate/Competitorn/a
Meas. Tech.ChEMBL_687158 (CHEMBL1291783)
IC50 6300±n/a nM
Citation Thewlis, KMAldegheri, LHarries, MHMookherjee, COliosi, BWard, SE N-substituted pyrrolidines and tetrahydrofurans as novel AMPAR positive modulators. Bioorg Med Chem Lett20:7116-9 (2010) 
 
Potassium voltage-gated channel subfamily H member 2
Name:Potassium voltage-gated channel subfamily H member 2
Type:Multi-pass membrane protein
Mol. Mass.:126672.65
Organism:Homo sapiens (Human)
Description:Q12809
Residue:1159
BDBM50331368
NameBDBM50331368
Synonyms:CHEMBL1290059 | N-((3R,4R)-1-isopropyl-4-(3'-(methylsulfonamido)biphenyl-4-yl)pyrrolidin-3-yl)propane-2-sulfonamide
TypeSmall organic molecule
Emp. Form.C23H33N3O4S2
Mol. Mass.479.656
SMILESCC(C)N1C[C@H](NS(=O)(=O)C(C)C)[C@H](C1)c1ccc(cc1)-c1cccc(NS(C)(=O)=O)c1