Reaction Details
TargetPotassium voltage-gated channel subfamily H member 2
LigandBDBM50331371
Substrate/Competitorn/a
Meas. Tech.ChEMBL_687158 (CHEMBL1291783)
IC50 400±n/a nM
Citation Thewlis, KMAldegheri, LHarries, MHMookherjee, COliosi, BWard, SE N-substituted pyrrolidines and tetrahydrofurans as novel AMPAR positive modulators. Bioorg Med Chem Lett20:7116-9 (2010) 
 
Potassium voltage-gated channel subfamily H member 2
Name:Potassium voltage-gated channel subfamily H member 2
Type:Multi-pass membrane protein
Mol. Mass.:126672.65
Organism:Homo sapiens (Human)
Description:Q12809
Residue:1159
BDBM50331371
NameBDBM50331371
Synonyms:CHEMBL1290275 | N-((3R,4R)-4-(4'-cyanobiphenyl-4-yl)-1-ethylpyrrolidin-3-yl)propane-2-sulfonamide
TypeSmall organic molecule
Emp. Form.C22H27N3O2S
Mol. Mass.397.534
SMILESCCN1C[C@H](NS(=O)(=O)C(C)C)[C@H](C1)c1ccc(cc1)-c1ccc(cc1)C#N