Reaction Details
TargetPotassium voltage-gated channel subfamily H member 2
LigandBDBM50331375
Substrate/Competitorn/a
Meas. Tech.ChEMBL_687158 (CHEMBL1291783)
IC50 12600±n/a nM
Citation Thewlis, KMAldegheri, LHarries, MHMookherjee, COliosi, BWard, SE N-substituted pyrrolidines and tetrahydrofurans as novel AMPAR positive modulators. Bioorg Med Chem Lett20:7116-9 (2010) 
 
Potassium voltage-gated channel subfamily H member 2
Name:Potassium voltage-gated channel subfamily H member 2
Type:Multi-pass membrane protein
Mol. Mass.:126672.65
Organism:Homo sapiens (Human)
Description:Q12809
Residue:1159
BDBM50331375
NameBDBM50331375
Synonyms:CHEMBL1290503 | N-(4'-((3R,4R)-1-methyl-4-(1-methylethylsulfonamido)pyrrolidin-3-yl)biphenyl-3-yl)acetamide
TypeSmall organic molecule
Emp. Form.C22H29N3O3S
Mol. Mass.415.549
SMILESCC(C)S(=O)(=O)N[C@H]1CN(C)C[C@@H]1c1ccc(cc1)-c1cccc(NC(C)=O)c1