Reaction Details
TargetPotassium voltage-gated channel subfamily H member 2
LigandBDBM50331377
Substrate/Competitorn/a
Meas. Tech.ChEMBL_687158 (CHEMBL1291783)
IC50 4000±n/a nM
Citation Thewlis, KMAldegheri, LHarries, MHMookherjee, COliosi, BWard, SE N-substituted pyrrolidines and tetrahydrofurans as novel AMPAR positive modulators. Bioorg Med Chem Lett20:7116-9 (2010) 
 
Potassium voltage-gated channel subfamily H member 2
Name:Potassium voltage-gated channel subfamily H member 2
Type:Multi-pass membrane protein
Mol. Mass.:126672.65
Organism:Homo sapiens (Human)
Description:Q12809
Residue:1159
BDBM50331377
NameBDBM50331377
Synonyms:CHEMBL1290612 | N-((3R,4R)-1-methyl-4-(3'-(trifluoromethyl)biphenyl-4-yl)pyrrolidin-3-yl)propane-2-sulfonamide
TypeSmall organic molecule
Emp. Form.C21H25F3N2O2S
Mol. Mass.426.496
SMILESCC(C)S(=O)(=O)N[C@H]1CN(C)C[C@@H]1c1ccc(cc1)-c1cccc(c1)C(F)(F)F