Reaction Details
TargetPotassium voltage-gated channel subfamily H member 2
LigandBDBM50331379
Substrate/Competitorn/a
Meas. Tech.ChEMBL_687158 (CHEMBL1291783)
IC50 31600±n/a nM
Citation Thewlis, KMAldegheri, LHarries, MHMookherjee, COliosi, BWard, SE N-substituted pyrrolidines and tetrahydrofurans as novel AMPAR positive modulators. Bioorg Med Chem Lett20:7116-9 (2010) 
 
Potassium voltage-gated channel subfamily H member 2
Name:Potassium voltage-gated channel subfamily H member 2
Type:Multi-pass membrane protein
Mol. Mass.:126672.65
Organism:Homo sapiens (Human)
Description:Q12809
Residue:1159
BDBM50331379
NameBDBM50331379
Synonyms:CHEMBL1290731 | N-((3R,4R)-1-methyl-4-(4-(pyridin-3-yl)phenyl)pyrrolidin-3-yl)propane-2-sulfonamide
TypeSmall organic molecule
Emp. Form.C19H25N3O2S
Mol. Mass.359.486
SMILESCC(C)S(=O)(=O)N[C@H]1CN(C)C[C@@H]1c1ccc(cc1)-c1cccnc1