Reaction Details
TargetPotassium voltage-gated channel subfamily H member 2
LigandBDBM50331380
Substrate/Competitorn/a
Meas. Tech.ChEMBL_687158 (CHEMBL1291783)
IC50 6300±n/a nM
Citation Thewlis, KMAldegheri, LHarries, MHMookherjee, COliosi, BWard, SE N-substituted pyrrolidines and tetrahydrofurans as novel AMPAR positive modulators. Bioorg Med Chem Lett20:7116-9 (2010) 
 
Potassium voltage-gated channel subfamily H member 2
Name:Potassium voltage-gated channel subfamily H member 2
Type:Multi-pass membrane protein
Mol. Mass.:126672.65
Organism:Homo sapiens (Human)
Description:Q12809
Residue:1159
BDBM50331380
NameBDBM50331380
Synonyms:CHEMBL1290732 | N-((3R,4R)-4-(4-(2-fluoropyridin-3-yl)phenyl)-1-methylpyrrolidin-3-yl)propane-2-sulfonamide
TypeSmall organic molecule
Emp. Form.C19H24FN3O2S
Mol. Mass.377.476
SMILESCC(C)S(=O)(=O)N[C@H]1CN(C)C[C@@H]1c1ccc(cc1)-c1cccnc1F