Reaction Details
TargetPotassium voltage-gated channel subfamily H member 2
LigandBDBM50331389
Substrate/Competitorn/a
Meas. Tech.ChEMBL_687158 (CHEMBL1291783)
IC50>63000±n/a nM
Citation Thewlis, KMAldegheri, LHarries, MHMookherjee, COliosi, BWard, SE N-substituted pyrrolidines and tetrahydrofurans as novel AMPAR positive modulators. Bioorg Med Chem Lett20:7116-9 (2010) 
 
Potassium voltage-gated channel subfamily H member 2
Name:Potassium voltage-gated channel subfamily H member 2
Type:Multi-pass membrane protein
Mol. Mass.:126672.65
Organism:Homo sapiens (Human)
Description:Q12809
Residue:1159
BDBM50331389
NameBDBM50331389
Synonyms:CHEMBL1289409 | N-((3S,4S)-4-(4-(5-fluoropyridin-2-yl)phenyl)tetrahydrofuran-3-yl)propane-2-sulfonamide
TypeSmall organic molecule
Emp. Form.C18H21FN2O3S
Mol. Mass.364.434
SMILESCC(C)S(=O)(=O)N[C@@H]1COC[C@@H]1c1ccc(cc1)-c1ccc(F)cn1