Reaction Details
TargetVitamin K-dependent protein C
LigandBDBM50331664
Substrate/Competitorn/a
Meas. Tech.ChEMBL_687653 (CHEMBL1290977)
IC50 395300±n/a nM
Citation Hanessian, SLarsson, AFex, TKnecht, WBlomberg, N Design and synthesis of macrocyclic indoles targeting blood coagulation cascade Factor XIa. Bioorg Med Chem Lett20:6925-8 (2010) 
 
Vitamin K-dependent protein C
Name:Vitamin K-dependent protein C
Type:Enzyme
Mol. Mass.:52067.73
Organism:Homo sapiens (Human)
Description:n/a
Residue:461
BDBM50331664
NameBDBM50331664
Synonyms:(4S,7R)-18-chloro-7-cyclohexyl-4-isobutyl-4,5,7,8,11,12,13,14-octahydro-1H-[1,4,7]triazacyclohexadeca[10,9-b]indole-3,6,9(2H,10H,15H)-trione | CHEMBL1290179
TypeSmall organic molecule
Emp. Form.C29H41ClN4O3
Mol. Mass.529.114
SMILESCC(C)C[C@@H]1NC(=O)[C@H](NC(=O)CCCCCc2[nH]c3ccc(Cl)cc3c2CNC1=O)C1CCCCC1