Reaction Details
TargetCoagulation factor XI
LigandBDBM50331672
Substrate/Competitorn/a
Meas. Tech.ChEMBL_687648 (CHEMBL1290972)
IC50 175900±n/a nM
Citation Hanessian, SLarsson, AFex, TKnecht, WBlomberg, N Design and synthesis of macrocyclic indoles targeting blood coagulation cascade Factor XIa. Bioorg Med Chem Lett20:6925-8 (2010) 
 
Coagulation factor XI
Name:Coagulation factor XI
Type:Enzyme
Mol. Mass.:70130.58
Organism:Homo sapiens (Human)
Description:P03951
Residue:625
BDBM50331672
NameBDBM50331672
Synonyms:CHEMBL1289978
TypeSmall organic molecule
Emp. Form.C28H41ClN4O4S
Mol. Mass.565.168
SMILESCC(C)C[C@@H]1NC(=O)[C@H](NS(=O)(=O)CCCCCc2[nH]c3ccc(Cl)cc3c2CNC1=O)C1CCCCC1