Reaction Details
TargetCarbonic anhydrase 2
LigandBDBM50332022
Substrate/Competitorn/a
Meas. Tech.ChEMBL_687566 (CHEMBL1290838)
Ki>100000±n/a nM
Citation Maresca, AScozzafava, ASupuran, CT 7,8-disubstituted- but not 6,7-disubstituted coumarins selectively inhibit the transmembrane, tumor-associated carbonic anhydrase isoforms IX and XII over the cytosolic ones I and II in the low nanomolar/subnanomolar range. Bioorg Med Chem Lett20:7255-8 (2010) 
 
Carbonic anhydrase 2
Name:Carbonic anhydrase 2
Type:Enzyme
Mol. Mass.:29250.71
Organism:Homo sapiens (Human)
Description:P00918
Residue:260
BDBM50332022
NameBDBM50332022
Synonyms:6-acetyl-7-(benzyloxy)-2H-chromen-2-one | CHEMBL1290010
TypeSmall organic molecule
Emp. Form.C18H14O4
Mol. Mass.294.3014
SMILESCC(=O)c1cc2ccc(=O)oc2cc1OCc1ccccc1