Reaction Details
TargetCarbonic anhydrase 1
LigandBDBM50332026
Substrate/Competitorn/a
Meas. Tech.ChEMBL_687565 (CHEMBL1290837)
Ki>100000±n/a nM
Citation Maresca, AScozzafava, ASupuran, CT 7,8-disubstituted- but not 6,7-disubstituted coumarins selectively inhibit the transmembrane, tumor-associated carbonic anhydrase isoforms IX and XII over the cytosolic ones I and II in the low nanomolar/subnanomolar range. Bioorg Med Chem Lett20:7255-8 (2010) 
 
Carbonic anhydrase 1
Name:Carbonic anhydrase 1
Type:Enzyme
Mol. Mass.:28873.37
Organism:Homo sapiens (Human)
Description:P00915
Residue:261
BDBM50332026
NameBDBM50332026
Synonyms:8-acetyl-7-propoxy-2H-chromen-2-one | CHEMBL1288596
TypeSmall organic molecule
Emp. Form.C14H14O4
Mol. Mass.246.2586
SMILESCCCOc1ccc2ccc(=O)oc2c1C(C)=O