Reaction Details
TargetZn finger protein
LigandBDBM50174558
Substrate/Competitorn/a
Meas. Tech.ChEMBL_687568 (CHEMBL1290840)
Ki 754±n/a nM
Citation Maresca, AScozzafava, ASupuran, CT 7,8-disubstituted- but not 6,7-disubstituted coumarins selectively inhibit the transmembrane, tumor-associated carbonic anhydrase isoforms IX and XII over the cytosolic ones I and II in the low nanomolar/subnanomolar range. Bioorg Med Chem Lett20:7255-8 (2010) 
 
Zn finger protein
Name:Zn finger protein
Synonyms:n/a
Type:PROTEIN
Mol. Mass.:25827.13
Organism:Nicotiana tabacum
Description:ChEMBL_687568
Residue:234
BDBM50174558
NameBDBM50174558
TypeSmall organic molecule
Emp. Form.C9H6O3
Mol. Mass.162.1421
SMILESOc1ccc2ccc(=O)oc2c1