Reaction Details
TargetCarbonic anhydrase 9
LigandBDBM50332039
Substrate/Competitorn/a
Meas. Tech.ChEMBL_687567 (CHEMBL1290839)
Ki 7800±n/a nM
Citation Maresca, AScozzafava, ASupuran, CT 7,8-disubstituted- but not 6,7-disubstituted coumarins selectively inhibit the transmembrane, tumor-associated carbonic anhydrase isoforms IX and XII over the cytosolic ones I and II in the low nanomolar/subnanomolar range. Bioorg Med Chem Lett20:7255-8 (2010) 
 
Carbonic anhydrase 9
Name:Carbonic anhydrase 9
Type:Enzyme
Mol. Mass.:49669.03
Organism:Homo sapiens (Human)
Description:Catalytic domain of human cloned isozyme was used in the assay
Residue:459
BDBM50332039
NameBDBM50332039
Synonyms:6-acetyl-7-methoxy-2H-chromen-2-one | CHEMBL1288558
TypeSmall organic molecule
Emp. Form.C12H10O4
Mol. Mass.218.2054
SMILESCOc1cc2oc(=O)ccc2cc1C(C)=O