Reaction Details
TargetGABA-A receptor; alpha-2/beta-3/gamma-2
LigandBDBM50332377
Substrate/Competitorn/a
Meas. Tech.ChEMBL_696706 (CHEMBL1638618)
Ki 1.5±n/a nM
Citation Liu, XFChang, HFSchmiesing, RJWesolowski, SSKnappenberger, KSArriza, JLChapdelaine, MJ Developing dual functional allosteric modulators of GABA(A) receptors. Bioorg Med Chem18:8374-82 (2010) 
 
GABA-A receptor; alpha-2/beta-3/gamma-2
Name:GABA-A receptor; alpha-2/beta-3/gamma-2
Type:n/a
Mol. Mass.:n/a
Description:ASSAY_ID of ChEMBL is 2148174
Components:This complex has 3 components.
Component 1
Name:Gamma-aminobutyric acid receptor subunit gamma-2
Synonyms:GABA(A) receptor subunit gamma-2 GBRG2_HUMAN
Type:PROTEIN
Mol. Mass.:54172.74
Organism:Homo sapiens (Human)
Description:EBI_217
Residue:467
Component 2
Name:Gamma-aminobutyric acid receptor subunit beta-3
Synonyms:GABA A receptor alpha-4/beta-3/gamma-2 GABA-A receptor GBRB3_HUMAN | agonist GABA site
Type:PROTEIN
Mol. Mass.:54130.51
Organism:Homo sapiens (Human)
Description:ChEMBL_448071
Residue:473
Component 3
Name:Gamma-aminobutyric acid receptor subunit alpha-2
Synonyms:GABA receptor alpha-2 subunit GBRA2_HUMAN | Gamma-aminobutyric acid receptor subunit alpha-2 (GABRA2)
Type:Protein
Mol. Mass.:51338.78
Organism:Homo sapiens (Human)
Description:P47869
Residue:451
BDBM50332377
NameBDBM50332377
Synonyms:9-Amino-2-cyclobutyl-5-(pyrimidin-5-yl)-2,3-dihydro-1H-pyrrolo[3,4-b]quinolin-1-one | CHEMBL1631469
TypeSmall organic molecule
Emp. Form.C19H17N5O
Mol. Mass.331.3712
SMILESNc1c2c(cn(C3CCC3)c2=O)[nH]c2c(cccc12)-c1cncnc1