Reaction Details
TargetDisintegrin and metalloproteinase domain-containing protein 17
LigandBDBM50224961
Substrate/Competitorn/a
Meas. Tech.ChEMBL_697249 (CHEMBL1640793)
IC50 520±n/a nM
Citation Yang, JSChun, KPark, JECho, MSeo, JSong, DYoon, HPark, CHJoe, BYChoi, JHKim, MHHan, G Structure based optimization of chromen-based TNF-a converting enzyme (TACE) inhibitors on S1' pocket and their quantitative structure-activity relationship (QSAR) study. Bioorg Med Chem18:8618-29 (2010) 
 
Disintegrin and metalloproteinase domain-containing protein 17
Name:Disintegrin and metalloproteinase domain-containing protein 17
Type:Enzyme
Mol. Mass.:93007.89
Organism:Homo sapiens (Human)
Description:
Residue:824
BDBM50224961
NameBDBM50224961
Synonyms:2-benzyl-N-hydroxy-3-(6-methyl-2-oxo-2H-chromen-3-yl)-propionamide | CHEMBL402030
TypeSmall organic molecule
Emp. Form.C20H19NO4
Mol. Mass.337.3692
SMILESCc1ccc2oc(=O)c(CC(Cc3ccccc3)C(=O)NO)cc2c1