Reaction Details
TargetHistone deacetylase 1
LigandBDBM50256975
Substrate/Competitorn/a
Meas. Tech.ChEMBL_695073 (CHEMBL1640690)
IC50 82±n/a nM
Citation Mahboobi, SSellmer, AWinkler, MEichhorn, EPongratz, HCiossek, TBaer, TMaier, TBeckers, T Novel chimeric histone deacetylase inhibitors: a series of lapatinib hybrides as potent inhibitors of epidermal growth factor receptor (EGFR), human epidermal growth factor receptor 2 (HER2), and histone deacetylase activity. J Med Chem53:8546-55 (2010) 
 
Histone deacetylase 1
Name:Histone deacetylase 1
Type:Enzyme
Mol. Mass.:55090.27
Organism:Homo sapiens (Human)
Description:Q13547
Residue:482
BDBM50256975
NameBDBM50256975
Synonyms:(4-(2-aminophenylcarbamoyl)benzylamino)methyl nicotinate | CHEMBL514671
TypeSmall organic molecule
Emp. Form.C21H20N4O3
Mol. Mass.376.4085
SMILESNc1ccccc1NC(=O)c1ccc(CNCOC(=O)c2cccnc2)cc1