Reaction Details
TargetHistone deacetylase 3
LigandBDBM50256975
Substrate/Competitorn/a
Meas. Tech.ChEMBL_695075 (CHEMBL1640692)
IC50 620±n/a nM
Citation Mahboobi, SSellmer, AWinkler, MEichhorn, EPongratz, HCiossek, TBaer, TMaier, TBeckers, T Novel chimeric histone deacetylase inhibitors: a series of lapatinib hybrides as potent inhibitors of epidermal growth factor receptor (EGFR), human epidermal growth factor receptor 2 (HER2), and histone deacetylase activity. J Med Chem53:8546-55 (2010) 
 
Histone deacetylase 3
Name:Histone deacetylase 3
Type:Enzyme
Mol. Mass.:48829.55
Organism:Homo sapiens (Human)
Description:O15379
Residue:428
BDBM50256975
NameBDBM50256975
Synonyms:(4-(2-aminophenylcarbamoyl)benzylamino)methyl nicotinate | CHEMBL514671
TypeSmall organic molecule
Emp. Form.C21H20N4O3
Mol. Mass.376.4085
SMILESNc1ccccc1NC(=O)c1ccc(CNCOC(=O)c2cccnc2)cc1