Reaction Details
TargetHistone deacetylase 8
LigandBDBM50332490
Substrate/Competitorn/a
Meas. Tech.ChEMBL_695076 (CHEMBL1640693)
IC50 7700±n/a nM
Citation Mahboobi, SSellmer, AWinkler, MEichhorn, EPongratz, HCiossek, TBaer, TMaier, TBeckers, T Novel chimeric histone deacetylase inhibitors: a series of lapatinib hybrides as potent inhibitors of epidermal growth factor receptor (EGFR), human epidermal growth factor receptor 2 (HER2), and histone deacetylase activity. J Med Chem53:8546-55 (2010) 
 
Histone deacetylase 8
Name:Histone deacetylase 8
Type:Enzyme
Mol. Mass.:41749.60
Organism:Homo sapiens (Human)
Description:Q9BY41
Residue:377
BDBM50332490
NameBDBM50332490
Synonyms:5-(4-(3-chloro-4-(3-fluorobenzyloxy)phenylamino)quinazolin-6-yl)-N-hydroxyfuran-2-carboxamide | CHEMBL1630117
TypeSmall organic molecule
Emp. Form.C26H18ClFN4O4
Mol. Mass.504.897
SMILESONC(=O)c1ccc(o1)-c1ccc2ncnc(Nc3ccc(OCc4cccc(F)c4)c(Cl)c3)c2c1