Reaction Details
TargetEpidermal growth factor receptor
LigandBDBM50332485
Substrate/Competitorn/a
Meas. Tech.ChEMBL_695077 (CHEMBL1640694)
IC50 2.8±n/a nM
Citation Mahboobi, SSellmer, AWinkler, MEichhorn, EPongratz, HCiossek, TBaer, TMaier, TBeckers, T Novel chimeric histone deacetylase inhibitors: a series of lapatinib hybrides as potent inhibitors of epidermal growth factor receptor (EGFR), human epidermal growth factor receptor 2 (HER2), and histone deacetylase activity. J Med Chem53:8546-55 (2010) 
 
Epidermal growth factor receptor
Name:Epidermal growth factor receptor
Type:Receptor Kinase Domain
Mol. Mass.:134279.59
Organism:Homo sapiens (Human)
Description:P00533
Residue:1210
BDBM50332485
NameBDBM50332485
Synonyms:CHEMBL1630112 | N-(2-aminophenyl)-5-(4-(3-chloro-4-(3-fluorobenzyloxy)phenylamino)quinazolin-6-yl)thiophene-2-carboxamide
TypeSmall organic molecule
Emp. Form.C32H23ClFN5O2S
Mol. Mass.596.074
SMILESNc1ccccc1NC(=O)c1ccc(s1)-c1ccc2ncnc(Nc3ccc(OCc4cccc(F)c4)c(Cl)c3)c2c1