Reaction Details
TargetTyrosine-protein kinase ABL1
LigandBDBM50332486
Substrate/Competitorn/a
Meas. Tech.ChEMBL_695081 (CHEMBL1640698)
IC50 4900±n/a nM
Citation Mahboobi, SSellmer, AWinkler, MEichhorn, EPongratz, HCiossek, TBaer, TMaier, TBeckers, T Novel chimeric histone deacetylase inhibitors: a series of lapatinib hybrides as potent inhibitors of epidermal growth factor receptor (EGFR), human epidermal growth factor receptor 2 (HER2), and histone deacetylase activity. J Med Chem53:8546-55 (2010) 
 
Tyrosine-protein kinase ABL1
Name:Tyrosine-protein kinase ABL1
Type:Enzyme
Mol. Mass.:122897.30
Organism:Homo sapiens (Human)
Description:P00519
Residue:1130
BDBM50332486
NameBDBM50332486
Synonyms:CHEMBL1630113 | N-(2-aminophenyl)-3-(5-(4-(3-chloro-4-(3-fluorobenzyloxy)phenylamino)quinazolin-6-yl)furan-2-yl)acrylamide
TypeSmall organic molecule
Emp. Form.C34H25ClFN5O3
Mol. Mass.606.045
SMILESNc1ccccc1NC(=O)\C=C\c1ccc(o1)-c1ccc2ncnc(Nc3ccc(OCc4cccc(F)c4)c(Cl)c3)c2c1