Reaction Details
TargetGlycogen synthase kinase-3 beta
LigandBDBM50332529
Substrate/Competitorn/a
Meas. Tech.ChEMBL_695103 (CHEMBL1640851)
IC50 10.8±n/a nM
Citation Khanfar, MAHill, RAKaddoumi, AEl Sayed, KA Discovery of novel GSK-3ß inhibitors with potent in vitro and in vivo activities and excellent brain permeability using combined ligand- and structure-based virtual screening. J Med Chem53:8534-45 (2010) 
 
Glycogen synthase kinase-3 beta
Name:Glycogen synthase kinase-3 beta
Type:Enzyme
Mol. Mass.:46756.38
Organism:Homo sapiens (Human)
Description:P49841
Residue:420
BDBM50332529
NameBDBM50332529
Synonyms:4-(9H-purin-6-ylamino)-2-((bis(2-chloroethyl)amino)methyl)phenol | CHEMBL1630434
TypeSmall organic molecule
Emp. Form.C16H18Cl2N6O
Mol. Mass.381.26
SMILESOc1ccc(Nc2ncnc3nc[nH]c23)cc1CN(CCCl)CCCl