Reaction Details
TargetGlycogen synthase kinase-3 beta
LigandBDBM50332532
Substrate/Competitorn/a
Meas. Tech.ChEMBL_695103 (CHEMBL1640851)
IC50 214±n/a nM
Citation Khanfar, MAHill, RAKaddoumi, AEl Sayed, KA Discovery of novel GSK-3ß inhibitors with potent in vitro and in vivo activities and excellent brain permeability using combined ligand- and structure-based virtual screening. J Med Chem53:8534-45 (2010) 
 
Glycogen synthase kinase-3 beta
Name:Glycogen synthase kinase-3 beta
Type:Enzyme
Mol. Mass.:46756.38
Organism:Homo sapiens (Human)
Description:P49841
Residue:420
BDBM50332532
NameBDBM50332532
Synonyms:(E)-5-(3,4,5-trimethoxybenzylidene)imidazolidine-2,4-dione | CHEMBL1630442
TypeSmall organic molecule
Emp. Form.C13H14N2O5
Mol. Mass.278.2607
SMILESCOc1cc(\C=C2\NC(=O)NC2=O)cc(OC)c1OC