Reaction Details
TargetBiP isoform A
LigandBDBM50332790
Substrate/Competitorn/a
Meas. Tech.ChEMBL_696628 (CHEMBL1641179)
IC50 50000±n/a nM
Citation Ispikoudi, MAmvrazis, MKontogiorgis, CKoumbis, AELitinas, KEHadjipavlou-Litina, DFylaktakidou, KC Convenient synthesis and biological profile of 5-amino-substituted 1,2,4-oxadiazole derivatives. Eur J Med Chem45:5635-45 (2010) 
 
BiP isoform A
Name:BiP isoform A
Synonyms:n/a
Type:PROTEIN
Mol. Mass.:73317.49
Organism:Glycine max
Description:ChEMBL_696628
Residue:664
BDBM50332790
NameBDBM50332790
TypeSmall organic molecule
Emp. Form.C16H18N4O4
Mol. Mass.330.3385
SMILESCC(=O)N(C1CCCCC1)c1nc(no1)-c1ccc(cc1)[N+]([O-])=O